BDBM93714 Furan-2-carboxylic acid naphtho[1,2-d]thiazol-2-ylamide::MLS000084989::N-(2-benzo[e][1,3]benzothiazolyl)-2-furancarboxamide::N-benzo[e][1,3]benzothiazol-2-yl-2-furamide::N-benzo[e][1,3]benzothiazol-2-ylfuran-2-carboxamide::SMR000019335::cid_565816
SMILES O=C(Nc1nc2c(ccc3ccccc23)s1)c1ccco1
InChI Key InChIKey=ITSJXNLSSAAKJV-UHFFFAOYSA-N
Data  2 IC50
  Tab Delimited (TSV)   2D SDfile   Computed 3D by Vconf -m prep SDfile
Find this compound or compounds like it in BindingDB:
Activity Spreadsheet -- Enzyme Inhibition Constant Data from BindingDB
Found 2 hits for monomerid = 93714
TargetHeat shock protein hsp-16.2(Caenorhabditis elegans)
Burnham Center For Chemical Genomics
Curated by PubChem BioAssay
LigandPNGBDBM93714(Furan-2-carboxylic acid naphtho[1,2-d]thiazol-2-yl...)
Affinity DataIC50: >6.40E+4nM
In DepthDetails PCBioAssay
TargetProtein skinhead-1(Caenorhabditis elegans)
Burnham Center For Chemical Genomics
Curated by PubChem BioAssay
LigandPNGBDBM93714(Furan-2-carboxylic acid naphtho[1,2-d]thiazol-2-yl...)
Affinity DataIC50:  1.77E+4nM
In DepthDetails PCBioAssay